{"text_format":"1","workbook":"xlsx","n_sheets":8,"sheets":["Instructions","Outstanding Errors and Warnings","Section A. Local CSBG Expen","Section B. Local Agency Capacit","Section C. Local CSBG Resources","Identification","XML Export Map","Lookups"],"not_rendered":{"charts":0,"images":1,"macros":1,"external_links":0,"defined_names":392,"comments":3,"pivot_tables":0},"unopened":[],"bounds":{"document_bytes":16777216,"sheet_cells":100000,"rows_first":2000,"rows_last":500,"rows_between":2000,"halvings":0,"cell_chars":16384,"cell_head_chars":4096},"cells_cut":0,"cells_raw":0,"read":"whole","date_system":"1900"}

{"sheet":"Instructions","index":0,"n_rows":40,"n_cols":3,"rows_kept":40,"cut":false,"hidden":false,"merged":[[4,1,4,3],[9,1,9,3],[37,1,37,3],[39,1,39,3],[35,1,35,3],[18,1,18,3],[33,1,33,3],[20,1,20,3],[24,1,24,2],[31,1,31,3],[22,1,22,3],[29,1,29,3],[6,1,6,3],[11,1,11,3]]}
[]
[null,null,"Instructional Notes"]
[null,null,"Module 2 SmartForm"]
[]
[null,"SmartForm Purpose"]
[]
[null,"The purpose of the Module 2 SmartForm is to:"]
[null,null,"1. Collect data required for reporting Module 2 of the CSBG Annual Report.\n2. Alert CSBG Eligible Entities of possible data quality issues during the data collection process.\n3. Provide CSBG Eligible Entities an explanation of possible data quality issues so they can determine whether the data needs to be modified.\n4. Provide State Offices a guided review of CSBG Eligible Entity reported data prior to finalizing and submitting data in OLDC."]
[]
[null,"Components of the Smart Form"]
[]
[null,"There are 5 tabs in the Module 2 SmartForm:"]
[null,null,"Module 2 Instructions - For more detailed guidance on Module 2 of the CSBG Annual Report, review the CSBG Annual Report, Module 2 Instruction Manual."]
[null,null,"Section A. Local CSBG Expen - This tab should be used by CSBG Eligible Entities to enter data on Module 2, Section A of the CSBG Annual Report"]
[null,null,"Section B. Local Agency Cap - This tab should be used by CSBG Eligible Entities to enter data on Module 2, Section B of the CSBG Annual Report"]
[null,null,"Section C Local CSBG Resources - This tab should be used by CSBG Eligible Entities to enter data on Module 2, Section C of the CSBG Annual Report"]
[null,null,"Outstanding Errors and Warnings Tab: This tab provides a summary list of data fields in Sections A, B, and C with possible data quality issues, as well as a brief description of the issues."]
[]
[null,"Error and Warning Messages - Overview"]
[]
{"$rows_left_out":21}
{"sheet":"Outstanding Errors and Warnings","index":1,"n_rows":19,"n_cols":6,"rows_kept":19,"cut":false,"hidden":false,"merged":[[3,1,3,4]]}
[]
[null,null,null,null,"Double click in any row to go to the cell that generated the error or warning."]
[]
[null,"Module 2 Errors and Warnings"]
[null,"Tab","Data Field","Severity","Message Description","A3_Admin"]
[null,"Section A. Local CSBG Expen","A.2i. CSBG Expenditures Domains - Agency Capacity Building","Warning","The value entered for the current year is greater than $0.00, while last year, the value reported here was $0.00.","M2A2iCapacity"]
[null,"Section B. Local Agency Capacit","B.4a. Staff with Certifications - ROMA Trainers","Warning","The value entered for the current year is greater than 0, while last year, the value reported here was 0.","M2B4aROMATrainers"]
[null,"Section C. Local CSBG Resources","C.3a. Federal Resources Allocated - Weatherization (DOE)","Warning","The value entered for the current year is greater than $0.00, while last year, the value reported here was $0.00.","M2C3aDOEWx"]
[null,"Section C. Local CSBG Resources","C.3b.1. Federal Resources Allocated - HHS - LIHEAP Fuel Assistance","Warning","The value entered for the current year is either more than double or less than half of the value reported last year.","M2C3b1LIHEAPAssist"]
[null,"Section C. Local CSBG Resources","C.3b.2. Federal Resources Allocated - HHS - LIHEAP Weatherization","Warning","The value entered for the current year is greater than $0.00, while last year, the value reported here was $0.00.","M2C3b2LIHEAPWx"]
[null,"Section C. Local CSBG Resources","C.3b.6. Federal Resources Allocated - HHS - SSBG","Warning","The value entered for the current year is either more than double or less than half of the value reported last year.","M2C3b6SSBG"]
[null,"Section C. Local CSBG Resources","C.3c.3. Federal Resources Allocated - USDA - Other Food Programs","Warning","The value entered for the current year is either more than double or less than half of the value reported last year.","M2C3c3USDAFood"]
[null,"Section C. Local CSBG Resources","C.3d.1. Federal Resources Allocated - HUD - CDBG","Warning","The value entered for the current year is greater than $0.00, while last year, the value reported here was $0.00.","M2C3d1CDBG"]
[null,"Section C. Local CSBG Resources","C.3d.4. Federal Resources Allocated - HUD - HOME TBRA","Warning","The value entered for the current year is greater than $0.00, while last year, the value reported here was $0.00.","M2C3d4HOMETBRA"]
[null,"Section C. Local CSBG Resources","C.3d.6. Federal Resources Allocated - HUD - ESG","Warning","The value entered for the current year is either more than double or less than half of the value reported last year.","M2C3d6ESG"]
[null,"Section C. Local CSBG Resources","C.3k. Federal Resources Allocated - Dept of Treasury","Warning","The value entered for the current year is greater than $0.00, while last year, the value reported here was $0.00.","M2C3kTreasury"]
[null,"Section C. Local CSBG Resources","C.4i. State Resources Allocated - Senior Programs","Warning","The value entered for the current year is greater than $0.00, while last year, the value reported here was $0.00.","M2C4iStateSenior"]
[null,"Section C. Local CSBG Resources","C.5a. Local Resources Allocated - Unrestricted Funds","Warning","The value entered for the current year is greater than $0.00, while last year, the value reported here was $0.00.","M2C5aLocalUnrestricted"]
[null,"Section C. Local CSBG Resources","M2C3liOtherFedDollar. Other HHS Resources - Specify 1","Warning","If you specify other HHS resources, you must enter a description, CFDA #, and $ value.","M2C3liOtherFedCFDA"]

{"sheet":"Section A. Local CSBG Expen","index":2,"n_rows":43,"n_cols":10,"rows_kept":43,"cut":false,"hidden":false,"merged":[[5,8,5,9],[2,2,2,3],[3,2,3,3],[4,8,4,9],[1,8,1,9],[2,8,2,9],[3,8,3,9],[1,2,1,3],[42,2,42,3],[36,2,36,3],[40,2,40,3],[41,2,41,3],[7,2,7,3],[37,2,39,3],[35,2,35,3],[14,2,14,3],[42,8,42,9],[41,8,41,9],[7,8,7,9],[14,8,14,9],[35,8,35,9],[36,8,36,9],[37,8,39,9],[40,8,40,9]]}
[]
[null,"FY 20","Module 2, Section A: Local Agency CSBG Expenditures - Data Entry Form",null,null,null,null,"FY 19","Module 2, Section A: Local Agency CSBG Expenditures - Data Entry Form"]
[null,null,"Name of CSBG Eligible Entity (enter below): ",null,null,null,null,null,"State Name:"]
[null,null,"Southeastern Utah Association of Local Governments"]
[null,null,"State Name (enter below):","DUNS",null,null,null,null,"Name of CSBG Eligible Entity:"]
[null,null,"Utah","097758627"]
[]
[null,null,"A.1  CSBG Eligible Entity Reporting Period: ",null,null,null,null,null,"A.1  CSBG Eligible Entity Reporting Period: "]
[]
[null,null,null,{"$f":"IF(Lookups!C15<>1,\"FATAL ERROR: Select One Checkbox\",\" \")","v":" "}]
[null,null,"A.1a.  July 1-June 30",null,null,null,null,null,"A.1a.  July 1-June 30"]
[null,null,"A.1b.  October 1-September 30",null,null,null,null,null,"A.1b.  October 1-September 30"]
[null,null,"A.1c.  January 1-December 31",null,null,null,null,null,"A.1c.  January 1-December 31"]
[]
[null,null,"A.2  CSBG Expenditures: \n",null,null,null,null,null,"A.2  CSBG Expenditures: \n"]
[]
[null,null,"CSBG Expenditures Domains","CSBG Funds",null,null,null,null,"CSBG Expenditures Domains","CSBG Funds"]
[null,null,"A.2a.  Employment",15825,null,null,null,null,"A.2a.  Employment",12473]
[null,null,"A.2b.  Education and Cognitive Development",null,null,null,null,null,"A.2b.  Education and Cognitive Development"]
[null,null,"A.2c.  Income, Infrastructure, and Asset Building",null,null,null,null,null,"A.2c.  Income, Infrastructure, and Asset Building"]
{"$rows_left_out":24}
{"sheet":"Section B. Local Agency Capacit","index":3,"n_rows":58,"n_cols":10,"rows_kept":58,"cut":false,"hidden":false,"merged":[[55,2,55,3],[3,8,3,9],[37,2,37,3],[39,2,39,3],[1,2,1,3],[1,8,1,9],[14,2,14,3],[18,2,18,3],[38,2,38,3],[38,8,39,9],[2,8,2,9]]}
[]
[null,"FY 20"," Module 2, Section B: Local Agency Capacity Building - Data Entry Form",null,null,null,null,"FY 19"," Module 2, Section B: Local Agency Capacity Building - Data Entry Form"]
[null,null,{"$f":"\"Name of CSBG Eligible Entity: \" & IF(M2AgencyName<>\"\",M2AgencyName,\" \")","v":"Name of CSBG Eligible Entity: Southeastern Utah Association of Local Governments"},"DUNS",null,null,null,null,"Name of CSBG Eligible Entity"]
[null,null,{"$f":"\"State Name: \" & IF(M2StateName<>\"\",M2StateName,\" \")","v":"State Name: Utah"},{"$f":"IF(M2DUNS<>\"\",M2DUNS,\" \")","v":"097758627"}]
[null,null,"^CODED TO PREPOULATE..DO NOT TOUCH "]
[null,null,"B.1. CSBG Eligibly Entity Reporting Period: ",null,null,null,null,null,"B.1. CSBG Eligibly Entity Reporting Period: "]
[null,null,"B.1.  CSBG Eligible Entity Reporting Period","\"X\"",null,null,null,null,"B.1.  CSBG Eligible Entity Reporting Period","\"X\""]
[null,null,"B.1a. July 1-June 30",null,false,null,null,null,"July 1-June 30"]
[null,null,"B.1b. October 1-September 30",null,true,null,null,null,"October 1-September 30"]
[null,null,"B.1c. January 1-December 31",null,false,null,null,null,"January 1-December 31"]
[]
[null,null,"B.2 Hours of Agency Capacity Building (e.g. training, planning, assessment):","Hours",null,null,null,null,"B.2 Hours of Agency Capacity Building (e.g. training, planning, assessment):","Hours"]
[null,null,"    B.2a. Hours of Board Members in capacity building activities",18,null,null,null,null,"     a. Hours of Board Members in Trainings",16]
[null,null,"    B.2b. Hours of Agency Staff in capacity building activities",336,null,null,null,null,"     b. Hours of Agency Staff in Trainings",317]
[]
[null,null,"B.3. Volunteer Hours of Agency Capacity Building (e.g. program support, service delivery, fundraising):"," Hours",null,null,null,null,"B.3. Volunteer Hours of Agency Capacity Building (e.g. program support, service delivery, fundraising):","Hours"]
[null,null,"B.3a. Total number of volunteer hours donated to the agency",12198,null,null,null,null,"B.3a. Number of Voluntee hours donated to the agency",13129]
[null,null,"B.3a.1. Of the above, the total number of volunteer hours donated by individuals with low-incomes",6175,null,null,null,null,"B.3a.1. Total number of volunteer hours donated by low-income individuals to community action",6721]
[]
[null,null,"B.4. The number of staff who hold certifications that increase agency capacity to achieve family and community outcomes, as measured by one or more of the following: ","Number",null,null,null,null,"B.4. The number of staff who hold certifications that increase agency capacity to achieve family and community outcomes, as measured by one or more of the following: ","Number"]
{"$rows_left_out":39}
{"sheet":"Section C. Local CSBG Resources","index":4,"n_rows":147,"n_cols":24,"rows_kept":147,"cut":false,"hidden":false,"merged":[[141,2,141,10],[139,16,140,21],[100,18,100,20],[101,18,101,20],[102,18,102,20],[112,16,113,21],[115,15,115,23],[124,16,125,21],[127,15,127,23],[139,3,140,8],[127,2,127,10],[115,2,115,10],[112,3,113,8],[124,3,125,8],[108,5,108,7],[106,5,106,7],[2,15,2,23],[5,15,5,23],[7,15,7,20],[7,21,7,23],[16,15,16,23],[8,21,10,24],[4,15,4,24],[83,15,83,23],[99,18,99,20],[100,5,100,7],[101,5,101,7],[102,5,102,7],[83,2,83,10],[99,5,99,7],[16,2,16,10],[2,2,2,10],[7,8,7,10],[7,2,7,7],[10,8,10,11],[8,8,8,11],[9,8,9,11],[4,6,4,11],[5,6,5,8],[5,2,5,5],[4,2,4,5],[107,5,107,7],[82,2,82,10],[126,2,126,11],[103,5,103,7],[104,5,104,7],[105,5,105,7]]}
[]
[]
[null,"FY 20","Module 2, Section C: Allocated Resources per CSBG Eligible Entity - Data Entry Form",null,null,null,null,null,null,null,null,null,null,null,"FY 19","Module 2, Section C: Allocated Resources per CSBG Eligible Entity - Data Entry Form"]
[]
[null,null,"Name of CSBG Eligble Entity:",null,null,null,{"$f":"IF(M2AgencyName<>\"\",M2AgencyName,\" \")","v":"Southeastern Utah Association of Local Governments"},null,null,null,null,null,null,null,null,"Name of CSBG Eligible Entity:"]
[null,null,"State Name:",null,null,null,{"$f":"IF(M2StateName<>\"\",M2StateName,\" \")","v":"Utah"},null,null,"DUNS:",{"$f":"IF(M2DUNS<>\"\",M2DUNS,\" \")","v":"097758627"}]
[]
[null,null,"C.1. CSBG Eligible Entity Reporting Period",null,null,null,null,null,"\"X\"",null,null,null,null,null,null,"C.1. CSBG Eligible Entity Reporting Period",null,null,null,null,null,"\"X\""]
[null,null,"C.1a. July 1 - June 30",null,null,null,null,null,null,null,null,null,false,null,null,"C.1a. July 1 - June 30"]
[null,null,"C.1b. October 1 - September 30",null,null,null,null,null,null,null,null,null,true,null,null,"C.1b. October 1 - September 30"]
[null,null,"C.1c. January 1 - December 31",null,null,null,null,null,null,null,null,null,false,null,null,"C.1c. January 1 - December 31"]
[]
[]
[null,null,"C.2. Amount of FY 2020 CSBG allocated to reporting entity",null,null,null,null,null,null,"C.2",216854,null,null,null,null,"C.2. Amount of FY 2019 CSBG allocated to reporting entity",null,null,null,null,null,null,"C.2",136379]
[]
[]
[null,null,"C.3. Federal Resources Allocated (Other than CSBG)",null,null,null,null,null,null,null,null,null,null,null,null,"C.3. Federal Resources Allocated (Other than CSBG)"]
[]
[null,null,"C.3a. Weatherization (DOE) (include oil overcharge $$)",null,null,null,null,null,null,"C.3a.",179606,null,null,null,null,"C.3a. Weatherization (DOE) (include oil overcharge $$)",null,null,null,null,null,null,"C.3a."]
[null,null,"C.3b. Health and Human Services (HHS)",null,null,null,null,null,null,null,null,null,null,null,null,"C.3b. Health and Human Services (HHS)"]
{"$rows_left_out":128}
{"sheet":"Identification","index":5,"n_rows":12,"n_cols":4,"rows_kept":12,"cut":false,"hidden":true,"merged":[]}
[null,null,"Version:","M2-2020.1"]
[]
[null,null,"State:",{"$f":"M2StateName","v":"Utah"}]
[null,null,"Name of CSBG Eligible Entity Reporting:",{"$f":"M2AgencyName","v":"Southeastern Utah Association of Local Governments"}]
[null,null,"DUNS Number:",{"$f":"M2DUNS","v":"097758627"}]
[null,null,"Organization:","ACF"]
[null,null,"Program Acronym:","CSBG"]
[null,null,"Lead Agency:","UTAH"]
[null,null,"Grant Number:","2001UTCOSR"]
[]
[null,null,"Report Period Start Date:","2019-10-01"]
[null,null,"Report Period End Date:","2020-09-30"]

{"sheet":"XML Export Map","index":6,"n_rows":221,"n_cols":10,"rows_kept":221,"cut":false,"hidden":true,"merged":[]}
[]
["Question/Reference","Smartform Range Name","Address","Value","Type","XML Export Name for DB","Max Length"]
[null,null,null,null,null,null,null,null,{"$f":"FIND(\"]\",J3)","v":87},{"$f":"CELL(\"address\",INDIRECT(B4))","v":"'[FY20_UT_M2_Southeastern_Utah_Association_of_Local_Governments_097758627 (1) (1).xlsm]Identification'!$D$8"}]
["leadAgency","M2LeadAgency",{"$f":"\"'='\" & MID(CELL(\"address\",INDIRECT(B4)),$I$3+1,100)","v":"'='Identification'!$D$8"},{"$f":"M2LeadAgency","v":"UTAH"},"Text","GRANTEENAME",100]
["State Name","M2StateName",{"$f":"\"'='\" & MID(CELL(\"address\",INDIRECT(B5)),$I$3+1,100)","v":"'='Section A. Local CSBG Expen'!$C$6"},{"$f":"M2StateName","v":"Utah"},"Text"]
["Agency Name","M2AgencyName",{"$f":"\"'='\" & MID(CELL(\"address\",INDIRECT(B6)),$I$3+1,100)","v":"'='Section A. Local CSBG Expen'!$C$4"},{"$f":"M2AgencyName","v":"Southeastern Utah Association of Local Governments"},"Text","ELIGIBLEENTITY"]
["orgAbbrev","M2OrgAbbrev",{"$f":"\"'='\" & MID(CELL(\"address\",INDIRECT(B7)),$I$3+1,100)","v":"'='Identification'!$D$6"},{"$f":"M2OrgAbbrev","v":"ACF"},"Text","orgAbbrev"]
["programAcronym","M2ProgramAcronym",{"$f":"\"'='\" & MID(CELL(\"address\",INDIRECT(B8)),$I$3+1,100)","v":"'='Identification'!$D$7"},{"$f":"M2ProgramAcronym","v":"CSBG"},"Text","programAcronym"]
["DUNS Number","M2Duns",{"$f":"\"'='\" & MID(CELL(\"address\",INDIRECT(B9)),$I$3+1,100)","v":"'='Section A. Local CSBG Expen'!$D$6"},{"$f":"M2DUNS","v":"097758627"},"Text","duns"]
["reportPeriodStartDate","M2ReportPeriodStartDate",{"$f":"\"'='\" & MID(CELL(\"address\",INDIRECT(B10)),$I$3+1,100)","v":"'='Identification'!$D$11"},{"$f":"M2ReportPeriodStartDate","v":"2019-10-01"},"Date","reportPeriodStartDate"]
["reportPeriodEndDate","M2ReportPeriodEndDate",{"$f":"\"'='\" & MID(CELL(\"address\",INDIRECT(B11)),$I$3+1,100)","v":"'='Identification'!$D$12"},{"$f":"M2ReportPeriodEndDate","v":"2020-09-30"},"Date","reportPeriodEndDate"]
["grantNumber","M2GrantNumber",{"$f":"\"'='\" & MID(CELL(\"address\",INDIRECT(B12)),$I$3+1,100)","v":"'='Identification'!$D$9"},{"$f":"M2GrantNumber","v":"2001UTCOSR"},"Text","grantNumber"]
["subGrantee",null,null,true,"True/False","subGrantee"]
["A1_Period","A1_Period",{"$f":"\"'='\" & MID(CELL(\"address\",INDIRECT(B14)),$I$3+1,100)","v":"'='Lookups'!$C$15"},{"$f":"IF(Lookups!$C$15=\"\",\"\",Lookups!$C$15)","v":1},"Number","M2A1"]
["A1_Period","Period_1",{"$f":"\"'='\" & MID(CELL(\"address\",INDIRECT(B15)),$I$3+1,100)","v":"'='Lookups'!$C$16"},{"$f":"IF(Lookups!$C$16=\"\",0,Lookups!$C$16)","v":false},"True/False","M2A1aJulyToJune"]
["A1_Period","Period_2",{"$f":"\"'='\" & MID(CELL(\"address\",INDIRECT(B16)),$I$3+1,100)","v":"'='Lookups'!$C$17"},{"$f":"IF(Lookups!$C$17=\"\",0,Lookups!$C$17)","v":true},"True/False","M2A1bOctToSept"]
["A1_Period","Period_3",{"$f":"\"'='\" & MID(CELL(\"address\",INDIRECT(B17)),$I$3+1,100)","v":"'='Lookups'!$C$18"},{"$f":"IF(Lookups!$C$18=\"\",0,Lookups!$C$18)","v":false},"True/False","M2A1cJanToDec"]
["A2a_Employment","M2A2aEmployment",{"$f":"\"'='\" & MID(CELL(\"address\",INDIRECT(B18)),$I$3+1,100)","v":"'='Section A. Local CSBG Expen'!$D$18"},{"$f":" IF(ISBLANK(M2A2aEmployment),\"\",M2A2aEmployment)","v":15825},"Number","M2A2aEmployment"]
["A2b_Education","M2A2bEducation",{"$f":"\"'='\" & MID(CELL(\"address\",INDIRECT(B19)),$I$3+1,100)","v":"'='Section A. Local CSBG Expen'!$D$19"},{"$f":" IF(ISBLANK(M2A2bEducation),\"\",M2A2bEducation)","v":""},"Number","M2A2bEducation"]
["A2c_Income","M2A2cIncome",{"$f":"\"'='\" & MID(CELL(\"address\",INDIRECT(B20)),$I$3+1,100)","v":"'='Section A. Local CSBG Expen'!$D$20"},{"$f":" IF(ISBLANK(M2A2cIncome),\"\",M2A2cIncome)","v":""},"Number","M2A2cIncome"]
{"$rows_left_out":202}
{"sheet":"Lookups","index":7,"n_rows":26,"n_cols":5,"rows_kept":26,"cut":false,"hidden":true,"merged":[]}
[]
[]
[null,"EditText_WsName","Housing NPIs"]
[null,"EditText_FieldName","FNPI 4z.1"]
[null,"EditText_Text","fff"]
[null,"EditText_Status","Cancel"]
[null,"EditText_MaxLength",4000]
[]
[null,"Max_Errors",500]
[]
[null,"XML_Filename","D:\\Work\\NASCSP - SmartForms\\SmartForms 2019-20\\Module 4 SmartForm - Employment Tab - 2019-20.xml"]
[]
[]
[]
[null,"A1_Period",{"$f":"COUNTIF(C16:C18,TRUE)","v":1}]
[null,"Period_1",false]
[null,"Period_2",true]
[null,"Period_3",false]
[]
[null,"A41_Activities",{"$f":"COUNTIF(Lookups!C22:C26,TRUE)","v":5}]
{"$rows_left_out":6}