{"text_format":"1","workbook":"xlsx","n_sheets":8,"sheets":["Instructions","Outstanding Errors and Warnings","Section A. Local CSBG Expen","Section B. Local Agency Capacit","Section C. Local CSBG Resources","Identification","XML Export Map","Lookups"],"not_rendered":{"charts":0,"images":0,"macros":1,"external_links":0,"defined_names":238,"comments":2,"pivot_tables":0},"unopened":[],"bounds":{"document_bytes":16777216,"sheet_cells":100000,"rows_first":2000,"rows_last":500,"rows_between":2000,"halvings":0,"cell_chars":16384,"cell_head_chars":4096},"cells_cut":0,"cells_raw":0,"read":"whole","date_system":"1900"}

{"sheet":"Instructions","index":0,"n_rows":14,"n_cols":3,"rows_kept":14,"cut":false,"hidden":false,"merged":[[13,1,13,3],[3,1,3,3],[11,1,11,3],[5,1,5,3],[6,1,6,3],[7,1,7,3],[8,1,8,3],[9,1,9,3],[10,1,10,3]]}
[]
[null,null,"Instructional Notes"]
[]
[null,"Module 2, Section A: CSBG Expenditures by CSBG Eligible Entity "]
[]
[null,"Section A: CSBG Expenditures by CSBG Eligible Entity Data Entry Form meets the Congressional requirement for an explanation of the total amount of CSBG funding expended during the reporting period (identified below) based on categories referenced in the CSBG Act. "]
[null,"CSBG funding expended during the reporting period should be identified in the domain that best reflects the services delivered and strategies implemented, as well as the administrative costs associated with the domains. "]
[null,"Module 2, Section B: CSBG Eligible Entity Capacity Building"]
[]
[null,"Section B: CSBG Eligible Entity Capacity Building Data Entry Form provides detail on agency capacity building funded by CSBG and other funding sources. "]
[]
[null,"Module 2, Section C: Allocated Resources per CSBG Eligible Entity "]
[]
[null,"Section C: Allocated Resources per CSBG Eligible Entity data entry form provides data on resources allocated to, administered through, and generated by the CSBG Eligible Entity.  This report provides valuable information on how CSBG  leverages funds from multiple federal, state, local, and private sources as required in the CSBG Act. \n\n"]

{"sheet":"Outstanding Errors and Warnings","index":1,"n_rows":14,"n_cols":6,"rows_kept":14,"cut":false,"hidden":false,"merged":[[3,1,3,4]]}
[]
[null,null,null,null,"Double click in any row to go to the cell that generated the error or warning."]
[]
[null,"Module 2 Errors and Warnings"]
[null,"Tab","Data Field","Severity","Message Description","A3_Admin"]
[null,"Section A. Local CSBG Expen","A.2a. CSBG Expenditures Domains - Employment","Warning","The value entered for the current year is either more than double or less than half of the value reported last year.","M2A2aEmployment"]
[null,"Section A. Local CSBG Expen","A.2c. CSBG Expenditures Domains - Income, Infrastructure, and Asset Building","Warning","The value entered for the current year is either more than double or less than half of the value reported last year.","M2A2cIncome"]
[null,"Section A. Local CSBG Expen","A.2d. CSBG Expenditures Domains - Housing","Warning","The value entered for the current year is greater than $0.00, while last year, the value reported here was $0.00.","M2A2dHousing"]
[null,"Section A. Local CSBG Expen","A.2e. CSBG Expenditures Domains - Health and Social/Behavioral Development","Warning","The value entered for the current year is either more than double or less than half of the value reported last year.","M2A2eHealth"]
[null,"Section A. Local CSBG Expen","A.2h. CSBG Expenditures Domains - Linkages","Warning","The value entered for the current year is greater than $0.00, while last year, the value reported here was $0.00.","M2A2hLinkages"]
[null,"Section A. Local CSBG Expen","A.2i. CSBG Expenditures Domains - Agency Capacity Building","Warning","The value entered for the current year is either more than double or less than half of the value reported last year.","M2A2iCapacity"]
[null,"Section A. Local CSBG Expen","A.3. CSBG Expenditures Domains - Administration","Warning","The value entered for the current year is either more than double or less than half of the value reported last year.","M2A3Admin"]
[null,"Section C. Local CSBG Resources","C.2. CSBG Resources Allocated","Warning","The value entered for the current year is either more than double or less than half of the value reported last year.","M2C2AmtAllocated"]
[null,"Section C. Local CSBG Resources","C.3c.3. Federal Resources Allocated - USDA - Other Food Programs","Warning","The value entered for the current year is $0.00, while last year, the value reported here was greater than $0.00.","M2C3c3USDAFood"]

{"sheet":"Section A. Local CSBG Expen","index":2,"n_rows":40,"n_cols":7,"rows_kept":40,"cut":false,"hidden":false,"merged":[[35,5,35,6],[37,5,37,6],[38,5,38,6],[39,5,39,6],[6,5,7,6],[28,5,28,6],[29,5,29,6],[30,5,30,6],[31,5,33,6],[34,5,34,6],[39,1,39,2],[37,1,37,2],[38,1,38,2],[0,1,0,2],[28,1,28,2],[30,1,30,2],[35,1,35,2],[31,1,33,2],[29,1,29,2],[1,1,1,2],[2,1,2,2],[34,1,34,2]]}
[null,"Module 2, Section A: CSBG CARES Supplemental Expenditures by CSBG Eligible Entity"]
[null,"Name of CSBG Eligible Entity (enter below): "]
[null,"Southeastern Utah Association of Local Governments"]
[null,"State Name (enter below):","DUNS"]
[null,"Utah","097758627"]
[]
[null,"A.1  CSBG Eligible Entity Reporting Period: ","\"X\"",null,null,"Prior Year Reported"]
[null,"A.1a.  July 1-June 30"]
[null,"A.1b.  October 1-September 30"]
[null,"A.1c.  January 1-December 31"]
[]
[null,"A.2. Amount of FY 2021 CSBG CARES Supplemental allocated to reporting entity:",170401,null,null,"A.2. Amount of FY 2020 CSBG CARES Supplemental allocated to reporting entity:",73092]
[]
[null,"A.3  CSBG CARES Supplemental Expenditures Domains \n","CSBG CARES Funds",null,null,"A.3  CSBG CARES Supplemental Expenditures Domains \n","CSBG CARES Funds"]
[null,"A.3a.  Employment",12249,null,null,"A.3a.  Employment",2153]
[null,"A.3b.  Education and Cognitive Development",null,null,null,"A.3b.  Education and Cognitive Development"]
[null,"A.3c.  Income, Infrastructure, and Asset Building",2378,null,null,"A.3c.  Income, Infrastructure, and Asset Building",989]
[null,"A.3d.  Housing",2789,null,null,"A.3d.  Housing"]
[null,"A.3e.  Health and Social/Behavioral Development (includes nutrition)",14481,null,null,"A.3e.  Health and Social/Behavioral Development (includes nutrition)",1566]
[null,"A.3f.  Civic Engagement and Community Involvement",null,null,null,"A.3f.  Civic Engagement and Community Involvement"]
[null,"A.3g.  Services Supporting Multiple Domains  ",null,null,null,"A.3g.  Services Supporting Multiple Domains  "]
[null,"A.3h.  Linkages (e.g. partnerships that support multiple domains for the specific purposes of disaster and/or emergency services)",1244,null,null,"A.3h.  Linkages (e.g. partnerships that support multiple domains for the specific purposes of disaster and/or emergency services)"]
[null,"A.3i.  Agency Capacity Building (detailed below in Table A.5)",3799,null,null,"A.3i.  Agency Capacity Building (detailed below in Table A.5)",1619]
[null,"A.3j.  Other (e.g. emergency management/disaster relief)",null,null,null,"A.3j.  Other (e.g. emergency management/disaster relief)"]
[null,"A.3k.   Total CSBG Expenditures (auto calculated)    ",{"$f":"SUM(C15:C24)","v":36940},null,null,"A.3k.   Total CSBG Expenditures (auto calculated)    ",{"$f":"SUM(G15:G24)","v":6327}]
[]
[null,"A.4  Of the CSBG funds reported above, report the total amount used for Administration. For more information on what qualifies as Administration, refer to IM37.",3277,null,null,"A.4  Of the CSBG funds reported above, report the total amount used for Administration. For more information on what qualifies as Administration, refer to IM37.",948]
[]
[null,"A.5  Details on Agency Capacity Building Activities Funded by CSBG:",null,null,null,"A.5  Details on Agency Capacity Building Activities Funded by CSBG:"]
[null,"A.5.1.   Please identify which activities were funded by CSBG under Agency Capacity in Table A.3. Please check all that apply.",null,null,null,"A.5.1.   Please identify which activities were funded by CSBG under Agency Capacity in Table A.3. Please check all that apply."]
{"$rows_left_out":11}
{"sheet":"Section B. Local Agency Capacit","index":3,"n_rows":58,"n_cols":5,"rows_kept":58,"cut":false,"hidden":true,"merged":[[55,1,55,2],[37,1,37,2],[39,1,39,2],[1,1,1,2],[14,1,14,2],[18,1,18,2],[38,1,38,2]]}
[]
[null," Module 2, Section B: Local Agency Capacity Building - Data Entry Form"]
[null,{"$f":"\"Name of CSBG Eligible Entity: \" & IF(M2AgencyName<>\"\",M2AgencyName,\" \")","v":"Name of CSBG Eligible Entity: Southeastern Utah Association of Local Governments"},"DUNS"]
[null,{"$f":"\"State Name: \" & IF(M2StateName<>\"\",M2StateName,\" \")","v":"State Name: Utah"},{"$f":"IF(M2DUNS<>\"\",M2DUNS,\" \")","v":"097758627"}]
[null,"^CODED TO PREPOULATE..DO NOT TOUCH "]
[null,"B.1. CSBG Eligibly Entity Reporting Period: "]
[null,"B.1.  CSBG Eligible Entity Reporting Period","\"X\""]
[null,"B.1a. July 1-June 30",null,null,false]
[null,"B.1b. October 1-September 30",null,null,false]
[null,"B.1c. January 1-December 31",null,null,false]
[]
[null,"B.2 Hours of Agency Capacity Building (e.g. training, planning, assessment):","Hours"]
[null,"    B.2a. Hours of Board Members in capacity building activities"]
[null,"    B.2b. Hours of Agency Staff in capacity building activities"]
[]
[null,"B.3. Volunteer Hours of Agency Capacity Building (e.g. program support, service delivery, fundraising):"," Hours"]
[null,"B.3a. Total number of volunteer hours donated to the agency"]
[null,"B.3a.1. Of the above, the total number of volunteer hours donated by individuals with low-incomes"]
[]
[null,"B.4. The number of staff who hold certifications that increase agency capacity to achieve family and community outcomes, as measured by one or more of the following: ","Number"]
[null,"B.4a. Number of Nationally Certified ROMA Trainers"]
[null,"B.4b. Number of Nationally Certified ROMA Implementers"]
[null,"B.4c. Number of Certified Community Action Professionals (CCAP)"]
[null,"B.4d. Number of Staff with a child development certification"]
[null,"B.4e. Number of Staff with a family development certification"]
[null,"B.4f. Number of Pathways Reviewers "]
[null,"B.4g. Number of Staff with Home Energy Professional Certifications"]
[null,"     B.4g.1. Number of Energy Auditors"]
[null,"     B.4g.2. Number of Retrofit Installer Technicians"]
[null,"     B.4g.3. Number of Crew Leaders"]
{"$rows_left_out":29}
{"sheet":"Section C. Local CSBG Resources","index":4,"n_rows":139,"n_cols":21,"rows_kept":139,"cut":false,"hidden":false,"merged":[[12,12,12,20],[6,12,7,20],[104,4,104,6],[78,1,78,9],[99,4,99,6],[100,4,100,6],[101,4,101,6],[102,4,102,6],[103,4,103,6],[96,4,96,6],[97,4,97,6],[98,4,98,6],[79,1,79,9],[95,4,95,6],[12,1,12,9],[0,1,0,9],[4,1,4,6],[1,5,1,9],[1,1,1,4],[2,5,2,7],[2,1,2,4],[133,2,134,7],[122,1,122,9],[111,1,111,9],[108,2,109,7],[119,2,120,7],[121,1,121,9]]}
[null,"Module 2, Section C: Allocated CARES Act Resources per CSBG Eligible Entity"]
[null,"Name of CSBG Eligble Entity:",null,null,null,{"$f":"IF(M2AgencyName<>\"\",M2AgencyName,\" \")","v":"Southeastern Utah Association of Local Governments"}]
[null,"State Name:",null,null,null,{"$f":"IF(M2StateName<>\"\",M2StateName,\" \")","v":"Utah"},null,null,"DUNS:",{"$f":"IF(M2DUNS<>\"\",M2DUNS,\" \")","v":"097758627"}]
[]
[null,"C.1. CSBG Eligible Entity Reporting Period",null,null,null,null,null,null,null,"\"X\""]
[null,"C.1a. July 1 - June 30",null,null,null,null,null,null,null,{"$f":"IF(Period_1,\"X\",\"\")","v":""},true]
[null,"C.1b. October 1 - September 30",null,null,null,null,null,null,null,{"$f":"IF(Period_2,\"X\",\"\")","v":"X"},false,null,"Prior Year Reported"]
[null,"C.1c. January 1 - December 31",null,null,null,null,null,null,null,{"$f":"IF(Period_3,\"X\",\"\")","v":""},false]
[]
[]
[null,"C.2. Amount of FY 2021 CSBG CARES funds allocated to reporting entity",null,null,null,null,null,null,null,30216,null,null,"C.2. Amount of FY 2020 CSBG CARES funds allocated to reporting entity",null,null,null,null,null,null,null,73092]
[]
[null,"C.3. Federal CARES Act Resources Allocated (Other than CSBG)",null,null,null,null,null,null,null,null,null,null,"C.3. Federal CARES Act Resources Allocated (Other than CSBG)"]
[]
[null,"C.3a. Weatherization (DOE) (include oil overcharge $$)",null,null,null,null,null,null,"C.3a.",null,null,null,"C.3a. Weatherization (DOE) (include oil overcharge $$)",null,null,null,null,null,null,"C.3a."]
[null,"C.3b. Health and Human Services (HHS)",null,null,null,null,null,null,null,null,null,null,"C.3b. Health and Human Services (HHS)"]
[null,null,"C.3b.1.",null,"LIHEAP - Fuel Assistance  (include oil overcharge $$)",null,null,null,"C.3b.1.",null,null,null,null,"C.3b.1.",null,"LIHEAP - Fuel Assistance  (include oil overcharge $$)",null,null,null,"C.3b.1."]
[null,null,"C.3b.2.",null,"LIHEAP - Weatherization  (include oil overcharge $$)",null,null,null,"C.3b.2.",null,null,null,null,"C.3b.2.",null,"LIHEAP - Weatherization  (include oil overcharge $$)",null,null,null,"C.3b.2."]
[null,null,"C.3b.3.",null,"Head Start",null,null,null,"C.3b.3.",null,null,null,null,"C.3b.3.",null,"Head Start",null,null,null,"C.3b.3."]
[null,null,"C.3b.4.",null,"Early Head Start",null,null,null,"C.3b.4.",null,null,null,null,"C.3b.4.",null,"Early Head Start",null,null,null,"C.3b.4."]
[null,null,"C.3b.5.",null,"Older Americans Act ",null,null,null,"C.3b.5.",157900,null,null,null,"C.3b.5.",null,"Older Americans Act ",null,null,null,"C.3b.5.",232600]
[null,null,"C.3b.6.",null,"Social Services Block Grant (SSBG)",null,null,null,"C.3b.6.",null,null,null,null,"C.3b.6.",null,"Social Services Block Grant (SSBG)",null,null,null,"C.3b.6."]
[null,null,"C.3b.7.",null,"Medicare/Medicaid ",null,null,null,"C.3b.7.",null,null,null,null,"C.3b.7.",null,"Medicare/Medicaid ",null,null,null,"C.3b.7."]
[null,null,"C.3b.8.",null,"Assets for Independence (AFI)",null,null,null,"C.3b.8.",null,null,null,null,"C.3b.8.",null,"Assets for Independence (AFI)",null,null,null,"C.3b.8."]
[null,null,"C.3b.9.",null,"Temporary Assistance for Needy Families (TANF)",null,null,null,"C.3b.9.",null,null,null,null,"C.3b.9.",null,"Temporary Assistance for Needy Families (TANF)",null,null,null,"C.3b.9."]
[null,null,"C.3b.10.",null,"Child Care Development Block Grant (CCDBG)",null,null,null,"C.3b.10.",null,null,null,null,"C.3b.10.",null,"Child Care Development Block Grant (CCDBG)",null,null,null,"C.3b.10."]
[null,null,"C.3b.11.",null,"Community Economic Development (CED)",null,null,null,"C.3b.11.",null,null,null,null,"C.3b.11.",null,"Community Economic Development (CED)",null,null,null,"C.3b.11."]
[null,null,"C.3b.12.",null,"Other HHS Resource Description",{"$f":"IF(AND(OR(AND(E29<>\"\",H29<>\"\",J29<>\"\"),AND(E29=\"\",H29=\"\",J29=\"\"), AND(E29=\"\",H29=\"\",J29=0)), OR(AND(E30<>\"\",H30<>\"\",J30<>\"\"),AND(E30=\"\",H30=\"\",J30=\"\"), AND(E30=\"\",H30=\"\",J30=0) ), OR(AND(E31<>\"\",H31<>\"\",J31<>\"\"),AND(E31=\"\",H31=\"\",J31=\"\"), AND(E31=\"\",H31=\"\",J31=0)), OR(AND(E32<>\"\",H32<>\"\",J32<>\"\"),AND(E32=\"\",H32=\"\",J32=\"\"), AND(E32=\"\",H32=\"\",J32=0))),\"\",\"ENTER DESCRIPTION, CFDA#, & DOLLAR AMOUNT BELOW\")","v":""},null,null,null,null,null,null,null,"C.3b.12.",null,"Other HHS Resource Description",{"$f":"IF(AND(OR(AND(P29<>\"\",S29<>\"\",U29<>\"\"),AND(P29=\"\",S29=\"\",U29=\"\"), AND(P29=\"\",S29=\"\",U29=0)), OR(AND(P30<>\"\",S30<>\"\",U30<>\"\"),AND(P30=\"\",S30=\"\",U30=\"\"), AND(P30=\"\",S30=\"\",U30=0) ), OR(AND(P31<>\"\",S31<>\"\",U31<>\"\"),AND(P31=\"\",S31=\"\",U31=\"\"), AND(P31=\"\",S31=\"\",U31=0)), OR(AND(P32<>\"\",S32<>\"\",U32<>\"\"),AND(P32=\"\",S32=\"\",U32=\"\"), AND(P32=\"\",S32=\"\",U32=0))),\"\",\"ENTER DESCRIPTION, CFDA#, & DOLLAR AMOUNT BELOW\")","v":""}]
[null,null,null,"C.3b.12.i.",null,null,"CFDA #:",null,"C.3b.12.i.",null,null,null,null,null,"C.3b.12.i.",null,null,"CFDA #:",null,"C.3b.12.i."]
[null,null,null,"C.3b.12.ii.",null,null,"CFDA #:",null,"C.3b.12.ii.",null,null,null,null,null,"C.3b.12.ii.",null,null,"CFDA #:",null,"C.3b.12.ii."]
{"$rows_left_out":110}
{"sheet":"Identification","index":5,"n_rows":12,"n_cols":4,"rows_kept":12,"cut":false,"hidden":true,"merged":[]}
[null,null,"Version:","M2_C-2020.1"]
[]
[null,null,"State:",{"$f":"M2StateName","v":"Utah"}]
[null,null,"Name of CSBG Eligible Entity Reporting:",{"$f":"M2AgencyName","v":"Southeastern Utah Association of Local Governments"}]
[null,null,"DUNS Number:",{"$f":"M2DUNS","v":"097758627"}]
[null,null,"Organization:"]
[null,null,"Program Acronym:"]
[null,null,"Lead Agency:","UTAH"]
[null,null,"Grant Number:"]
[]
[null,null,"Report Period Start Date:",{"$f":"IF(Period_1,\"07-01-2019\",IF(Period_2,\"10-01-2019\",\"01-01-2020\"))","v":"10-01-2019"}]
[null,null,"Report Period End Date:",{"$f":"IF(Period_1,\"06-30-2020\",IF(Period_2,\"09-30-2020\",\"12-31-2020\"))","v":"09-30-2020"}]

{"sheet":"XML Export Map","index":6,"n_rows":223,"n_cols":10,"rows_kept":223,"cut":false,"hidden":true,"merged":[]}
[]
["Question/Reference","Smartform Range Name","Address","Value","Type","XML Export Name for DB","Max Length",null,{"$f":"FIND(\"]\",J2)","v":97},{"$f":"CELL(\"address\",INDIRECT(B4))","v":"'[FY21_UT_CARES_M2_Southeastern_Utah_Association_of_Local_Governments_097758627 Updated (7).xlsm]Identification'!$D$8"}]
[]
["leadAgency","M2LeadAgency",{"$f":"\"'='\" & MID(CELL(\"address\",INDIRECT(B4)),$I$2+1,100)","v":"'='Identification'!$D$8"},{"$f":"M2LeadAgency","v":"UTAH"},"Text","GRANTEENAME",100]
["State Name","M2StateName",{"$f":"\"'='\" & MID(CELL(\"address\",INDIRECT(B5)),$I$2+1,100)","v":"'='Section A. Local CSBG Expen'!$B$5"},{"$f":"M2StateName","v":"Utah"},"Text"]
["Agency Name","M2AgencyName",{"$f":"\"'='\" & MID(CELL(\"address\",INDIRECT(B6)),$I$2+1,100)","v":"'='Section A. Local CSBG Expen'!$B$3"},null,"Text","ELIGIBLEENTITY"]
["orgAbbrev","M2OrgAbbrev",{"$f":"\"'='\" & MID(CELL(\"address\",INDIRECT(B7)),$I$2+1,100)","v":"'='Identification'!$D$6"},"ACF","Text","orgAbbrev"]
["programAcronym","M2ProgramAcronym",{"$f":"\"'='\" & MID(CELL(\"address\",INDIRECT(B8)),$I$2+1,100)","v":"'='Identification'!$D$7"},"CSC3","Text","programAcronym"]
["DUNS Number","M2Duns",{"$f":"\"'='\" & MID(CELL(\"address\",INDIRECT(B9)),$I$2+1,100)","v":"'='Section A. Local CSBG Expen'!$C$5"},{"$f":"M2DUNS","v":"097758627"},"Text","duns"]
["reportPeriodStartDate","M2ReportPeriodStartDate",{"$f":"\"'='\" & MID(CELL(\"address\",INDIRECT(B10)),$I$2+1,100)","v":"'='Identification'!$D$11"},"2019-10-01","Date","reportPeriodStartDate"]
["reportPeriodEndDate","M2ReportPeriodEndDate",{"$f":"\"'='\" & MID(CELL(\"address\",INDIRECT(B11)),$I$2+1,100)","v":"'='Identification'!$D$12"},"2020-09-30","Date","reportPeriodEndDate"]
["grantNumber","M2GrantNumber",{"$f":"\"'='\" & MID(CELL(\"address\",INDIRECT(B12)),$I$2+1,100)","v":"'='Identification'!$D$9"},null,"Text","grantNumber"]
["subGrantee",null,null,true,"True/False","subGrantee"]
["A1_Period","A1_Period",{"$f":"\"'='\" & MID(CELL(\"address\",INDIRECT(B14)),$I$2+1,100)","v":"'='Lookups'!$C$15"},{"$f":"IF(Lookups!$C$15=\"\",\"\",Lookups!$C$15)","v":1},"Number","M2A1"]
["A1_Period","Period_1",{"$f":"\"'='\" & MID(CELL(\"address\",INDIRECT(B15)),$I$2+1,100)","v":"'='Lookups'!$C$16"},{"$f":"IF(Lookups!$C$16=\"\",0,Lookups!$C$16)","v":false},"True/False","M2A1aJulyToJune"]
["A1_Period","Period_2",{"$f":"\"'='\" & MID(CELL(\"address\",INDIRECT(B16)),$I$2+1,100)","v":"'='Lookups'!$C$17"},{"$f":"IF(Lookups!$C$17=\"\",0,Lookups!$C$17)","v":true},"True/False","M2A1bOctToSept"]
["A1_Period","Period_3",{"$f":"\"'='\" & MID(CELL(\"address\",INDIRECT(B17)),$I$2+1,100)","v":"'='Lookups'!$C$18"},{"$f":"IF(Lookups!$C$18=\"\",0,Lookups!$C$18)","v":false},"True/False","M2A1cJanToDec"]
["A2_CARES_Amount","M2A2CARESAmount",{"$f":"\"'='\" & MID(CELL(\"address\",INDIRECT(B18)),$I$2+1,100)","v":"'='Section A. Local CSBG Expen'!$C$12"},{"$f":" IF(ISBLANK(M2A2CARESAmount),\"\",M2A2CARESAmount)","v":170401},"Number","M2A2CARESAmount"]
["A2a_Employment","M2A2aEmployment",{"$f":"\"'='\" & MID(CELL(\"address\",INDIRECT(B19)),$I$2+1,100)","v":"'='Section A. Local CSBG Expen'!$C$15"},{"$f":" IF(ISBLANK(M2A2aEmployment),\"\",M2A2aEmployment)","v":12249},"Number","M2A2aEmployment"]
["A2b_Education","M2A2bEducation",{"$f":"\"'='\" & MID(CELL(\"address\",INDIRECT(B20)),$I$2+1,100)","v":"'='Section A. Local CSBG Expen'!$C$16"},{"$f":" IF(ISBLANK(M2A2bEducation),\"\",M2A2bEducation)","v":""},"Number","M2A2bEducation"]
["A2c_Income","M2A2cIncome",{"$f":"\"'='\" & MID(CELL(\"address\",INDIRECT(B21)),$I$2+1,100)","v":"'='Section A. Local CSBG Expen'!$C$17"},{"$f":" IF(ISBLANK(M2A2cIncome),\"\",M2A2cIncome)","v":2378},"Number","M2A2cIncome"]
["A2d_Housing","M2A2dHousing",{"$f":"\"'='\" & MID(CELL(\"address\",INDIRECT(B22)),$I$2+1,100)","v":"'='Section A. Local CSBG Expen'!$C$18"},{"$f":" IF(ISBLANK(M2A2dHousing),\"\",M2A2dHousing)","v":2789},"Number","M2A2dHousing"]
["A2e_Health","M2A2eHealth",{"$f":"\"'='\" & MID(CELL(\"address\",INDIRECT(B23)),$I$2+1,100)","v":"'='Section A. Local CSBG Expen'!$C$19"},{"$f":" IF(ISBLANK(M2A2eHealth),\"\",M2A2eHealth)","v":14481},"Number","M2A2eHealth"]
["A2f_Civic","M2A2fCivic",{"$f":"\"'='\" & MID(CELL(\"address\",INDIRECT(B24)),$I$2+1,100)","v":"'='Section A. Local CSBG Expen'!$C$20"},{"$f":" IF(ISBLANK(M2A2fCivic),\"\",M2A2fCivic)","v":""},"Number","M2A2fCivic"]
["A2g_Services","M2A2gServices",{"$f":"\"'='\" & MID(CELL(\"address\",INDIRECT(B25)),$I$2+1,100)","v":"'='Section A. Local CSBG Expen'!$C$21"},{"$f":" IF(ISBLANK(M2A2gServices),\"\",M2A2gServices)","v":""},"Number","M2A2gServices"]
["A2h_Linkages","M2A2hLinkages",{"$f":"\"'='\" & MID(CELL(\"address\",INDIRECT(B26)),$I$2+1,100)","v":"'='Section A. Local CSBG Expen'!$C$22"},{"$f":" IF(ISBLANK(M2A2hLinkages),\"\",M2A2hLinkages)","v":1244},"Number","M2A2hLinkages"]
["A2i_Capacity","M2A2iCapacity",{"$f":"\"'='\" & MID(CELL(\"address\",INDIRECT(B27)),$I$2+1,100)","v":"'='Section A. Local CSBG Expen'!$C$23"},{"$f":" IF(ISBLANK(M2A2iCapacity),\"\",M2A2iCapacity)","v":3799},"Number","M2A2iCapacity"]
["A2j_Other","M2A2jOther",{"$f":"\"'='\" & MID(CELL(\"address\",INDIRECT(B28)),$I$2+1,100)","v":"'='Section A. Local CSBG Expen'!$C$24"},{"$f":" IF(ISBLANK(M2A2jOther),\"\",M2A2jOther)","v":""},"Number","M2A2jOther"]
["A2k_Total","M2A2kTotal",{"$f":"\"'='\" & MID(CELL(\"address\",INDIRECT(B29)),$I$2+1,100)","v":"'='Section A. Local CSBG Expen'!$C$25"},{"$f":" IF(ISBLANK(M2A2kTotal),\"\",M2A2kTotal)","v":36940},"Number","M2A2kTotal"]
["A3_Admin","M2A3Admin",{"$f":"\"'='\" & MID(CELL(\"address\",INDIRECT(B30)),$I$2+1,100)","v":"'='Section A. Local CSBG Expen'!$C$27"},{"$f":" IF(ISBLANK(M2A3Admin),\"\",M2A3Admin)","v":3277},"Number","M2A3Admin"]
{"$rows_left_out":194}
{"sheet":"Lookups","index":7,"n_rows":26,"n_cols":8,"rows_kept":26,"cut":false,"hidden":true,"merged":[]}
[]
[]
[null,"EditText_WsName","Housing NPIs"]
[null,"EditText_FieldName","FNPI 4z.1"]
[null,"EditText_Text","fff"]
[null,"EditText_Status","Cancel"]
[null,"EditText_MaxLength",4000]
[]
[null,"Max_Errors",500]
[]
[null,"XML_Filename","D:\\Work\\NASCSP - SmartForms\\SmartForms 2019-20\\Module 4 SmartForm - Employment Tab - 2019-20.xml"]
[]
[]
[]
[null,"A1_Period",{"$f":"COUNTIF(C16:C18,TRUE)","v":1}]
[null,"Period_1",false,{"$f":"Period_1","v":false},null,null,null,false]
[null,"Period_2",true,{"$f":"Period_2","v":true},null,null,null,true]
[null,"Period_3",false,{"$f":"Period_3","v":false},null,null,null,false]
[]
[null,"A41_Activities",{"$f":"COUNTIF(Lookups!C22:C26,TRUE)","v":3}]
[null,null,null,null,null,null,"Prior Year"]
[null,null,false,"community",null,null,false]
[null,null,true,"data mgmt",null,null,false]
[null,"A41_Other",true,"other",null,null,true]
[null,null,false,"planning",null,null,false]
[null,null,true,"training",null,null,true]